Reaction Details
TargetCathepsin K
LigandBDBM50121030
Substrate/Competitorn/a
Meas. Tech.ChEBML_48349
IC50 5±n/a nM
Citation Zhou, NEGuo, DKaleta, JPurisima, EMenard, RMicetich, RGSingh, R Design and synthesis of 6-substituted amino-4-oxa-1-azabicyclo[3,2,0]heptan-7-one derivatives as cysteine proteases inhibitors. Bioorg Med Chem Lett12:3413-5 (2002) Cathepsin K
Name:Cathepsin K
Type:Enzyme
Mol. Mass.:36975.68
Organism:Homo sapiens (Human)
Description:P43235
Residue:329
BDBM50121030
NameBDBM50121030
Synonyms:CHEMBL115734 | [(S)-1-((5S,6S)-7-Oxo-4-oxa-1-aza-bicyclo[3.2.0]hept-6-ylcarbamoyl)-2-phenyl-propyl]-carbamic acid benzyl ester
TypeSmall organic molecule
Emp. Form.C22H23N3O5
Mol. Mass.409.4351
SMILESO=C(N[C@@H](Cc1ccccc1)C(=O)N[C@H]1[C@@H]2OCCN2C1=O)OCc1ccccc1