Reaction Details
TargetCathepsin K
LigandBDBM50121039
Substrate/Competitorn/a
Meas. Tech.ChEBML_48350
IC50 7.6±n/a nM
Citation Zhou, NEKaleta, JPurisima, EMenard, RMicetich, RGSingh, R 6-Acylamino-penam derivatives: synthesis and inhibition of cathepsins B, L, K, and S. Bioorg Med Chem Lett12:3417-9 (2002) Cathepsin K
Name:Cathepsin K
Type:Enzyme
Mol. Mass.:36975.68
Organism:Homo sapiens (Human)
Description:P43235
Residue:329
BDBM50121039
NameBDBM50121039
Synonyms:CHEMBL114410 | [(S)-2-Cyclohexyl-1-((5S,6R)-4,4,7-trioxo-4lambda*6*-thia-1-aza-bicyclo[3.2.0]hept-6-ylcarbamoyl)-ethyl]-carbamic acid benzyl ester
TypeSmall organic molecule
Emp. Form.C22H29N3O6S
Mol. Mass.463.547
SMILESO=C(N[C@@H](CC1CCCCC1)C(=O)N[C@H]1[C@H]2N(CCS2(=O)=O)C1=O)OCc1ccccc1