Reaction Details
TargetCathepsin S
LigandBDBM50121044
Substrate/Competitorn/a
Meas. Tech.ChEBML_48690
IC50 8±n/a nM
Citation Zhou, NEKaleta, JPurisima, EMenard, RMicetich, RGSingh, R 6-Acylamino-penam derivatives: synthesis and inhibition of cathepsins B, L, K, and S. Bioorg Med Chem Lett12:3417-9 (2002) Cathepsin S
Name:Cathepsin S
Type:Protein
Mol. Mass.:37507.38
Organism:Homo sapiens (Human)
Description:P25774
Residue:331
BDBM50121044
NameBDBM50121044
Synonyms:CHEMBL116041 | [(S)-2-(3-Fluoro-phenyl)-1-((5S,6R)-4,4,7-trioxo-4lambda*6*-thia-1-aza-bicyclo[3.2.0]hept-6-ylcarbamoyl)-ethyl]-carbamic acid benzyl ester
TypeSmall organic molecule
Emp. Form.C22H22FN3O6S
Mol. Mass.475.49
SMILESFc1cccc(C[C@H](NC(=O)OCc2ccccc2)C(=O)N[C@H]2[C@H]3N(CCS3(=O)=O)C2=O)c1