Reaction Details
TargetGonadotropin-releasing hormone receptor
LigandBDBM50121097
Substrate/Competitorn/a
Meas. Tech.ChEBML_71598
Ki 54±n/a nM
Citation Luthin, DRHong, YPathak, VPPaderes, GNared-Hood, KDCastro, MAVazir, HLi, HTompkins, EChristie, LMay, JMAnderson, MB The discovery of novel small molecule non-peptide gonadotropin releasing hormone (GnRH) receptor antagonists. Bioorg Med Chem Lett12:3467-70 (2002) Gonadotropin-releasing hormone receptor
Name:Gonadotropin-releasing hormone receptor
Type:Enzyme
Mol. Mass.:37749.45
Organism:Homo sapiens (Human)
Description:P30968
Residue:328
BDBM50121097
NameBDBM50121097
Synonyms:4-({[5-(3,5,5,8,8-Pentamethyl-5,6,7,8-tetrahydro-naphthalen-2-ylmethyl)-furan-2-carbonyl]-amino}-methyl)-piperidine-1-carboxylic acid tert-butyl ester | CHEMBL323863
TypeSmall organic molecule
Emp. Form.C32H46N2O4
Mol. Mass.522.7186
SMILESCc1cc2c(cc1Cc1ccc(o1)C(=O)NCC1CCN(CC1)C(=O)OC(C)(C)C)C(C)(C)CCC2(C)C