Reaction Details
TargetGonadotropin-releasing hormone receptor
LigandBDBM50121087
Substrate/Competitorn/a
Meas. Tech.ChEBML_71598
Ki 24±n/a nM
Citation Luthin, DRHong, YPathak, VPPaderes, GNared-Hood, KDCastro, MAVazir, HLi, HTompkins, EChristie, LMay, JMAnderson, MB The discovery of novel small molecule non-peptide gonadotropin releasing hormone (GnRH) receptor antagonists. Bioorg Med Chem Lett12:3467-70 (2002) Gonadotropin-releasing hormone receptor
Name:Gonadotropin-releasing hormone receptor
Type:Enzyme
Mol. Mass.:37749.45
Organism:Homo sapiens (Human)
Description:P30968
Residue:328
BDBM50121087
NameBDBM50121087
Synonyms:5-(3,5,5,8,8-Pentamethyl-5,6,7,8-tetrahydro-naphthalen-2-ylmethyl)-furan-2-carboxylic acid (4-{[(2,6-dioxo-1,2,3,6-tetrahydro-pyrimidin-4-ylmethyl)-amino]-methyl}-cyclohexylmethyl)-amide | CHEMBL325747
TypeSmall organic molecule
Emp. Form.C34H46N4O4
Mol. Mass.574.7534
SMILESCc1cc2c(cc1Cc1ccc(o1)C(=O)NCC1CCC(CNCc3cc(=O)[nH]c(=O)[nH]3)CC1)C(C)(C)CCC2(C)C