Reaction Details
TargetGonadotropin-releasing hormone receptor
LigandBDBM50121094
Substrate/Competitorn/a
Meas. Tech.ChEBML_71598
Ki 140±n/a nM
Citation Luthin, DRHong, YPathak, VPPaderes, GNared-Hood, KDCastro, MAVazir, HLi, HTompkins, EChristie, LMay, JMAnderson, MB The discovery of novel small molecule non-peptide gonadotropin releasing hormone (GnRH) receptor antagonists. Bioorg Med Chem Lett12:3467-70 (2002) Gonadotropin-releasing hormone receptor
Name:Gonadotropin-releasing hormone receptor
Type:Enzyme
Mol. Mass.:37749.45
Organism:Homo sapiens (Human)
Description:P30968
Residue:328
BDBM50121094
NameBDBM50121094
Synonyms:5-(3,5,5,8,8-Pentamethyl-5,6,7,8-tetrahydro-naphthalen-2-ylmethyl)-furan-2-carboxylic acid 4-aminomethyl-benzylamide | CHEMBL119856
TypeSmall organic molecule
Emp. Form.C29H36N2O2
Mol. Mass.444.6083
SMILESCc1cc2c(cc1Cc1ccc(o1)C(=O)NCc1ccc(CN)cc1)C(C)(C)CCC2(C)C