Reaction Details
TargetGonadotropin-releasing hormone receptor
LigandBDBM50121081
Substrate/Competitorn/a
Meas. Tech.ChEBML_71749
Ki 270±n/a nM
Citation Luthin, DRHong, YPathak, VPPaderes, GNared-Hood, KDCastro, MAVazir, HLi, HTompkins, EChristie, LMay, JMAnderson, MB The discovery of novel small molecule non-peptide gonadotropin releasing hormone (GnRH) receptor antagonists. Bioorg Med Chem Lett12:3467-70 (2002) Gonadotropin-releasing hormone receptor
Name:Gonadotropin-releasing hormone receptor
Type:PROTEIN
Mol. Mass.:37767.60
Organism:Rattus norvegicus
Description:ChEMBL_1335047
Residue:327
BDBM50121081
NameBDBM50121081
Synonyms:5-(3,5,5,8,8-Pentamethyl-5,6,7,8-tetrahydro-naphthalen-2-ylmethyl)-furan-2-carboxylic acid (4-carbamoyl-cyclohexylmethyl)-amide | CHEMBL117863
TypeSmall organic molecule
Emp. Form.C29H40N2O3
Mol. Mass.464.6395
SMILESCc1cc2c(cc1Cc1ccc(o1)C(=O)NC[C@H]1CC[C@@H](CC1)C(N)=O)C(C)(C)CCC2(C)C