Reaction Details
TargetCathepsin K
LigandBDBM50121286
Substrate/Competitorn/a
Meas. Tech.ChEMBL_48325 (CHEMBL663315)
Ki 1000±n/a nM
Citation Chowdhury, SFSivaraman, JWang, JDevanathan, GLachance, PQi, HMénard, RLefebvre, JKonishi, YCygler, MSulea, TPurisima, EO Design of noncovalent inhibitors of human cathepsin L. From the 96-residue proregion to optimized tripeptides. J Med Chem45:5321-9 (2002) Cathepsin K
Name:Cathepsin K
Type:Enzyme
Mol. Mass.:36975.68
Organism:Homo sapiens (Human)
Description:P43235
Residue:329
BDBM50121286
NameBDBM50121286
Synonyms:2-[2-(2-Biphenyl-4-yl-acetylamino)-3-mercapto-propionylamino]-5-guanidino-pentanoic acid [2-(1H-indol-3-yl)-1-phenethylcarbamoyl-ethyl]-amide | CHEMBL150808
TypeSmall organic molecule
Emp. Form.C42H48N8O4S
Mol. Mass.760.947
SMILESNC(=N)NCCCC(NC(=O)C(CS)NC(=O)Cc1ccc(cc1)-c1ccccc1)C(=O)NC(Cc1c[nH]c2ccccc12)C(=O)NCCc1ccccc1