Reaction Details
TargetPeroxisome proliferator-activated receptor gamma
LigandBDBM50121418
Substrate/Competitorn/a
Meas. Tech.ChEMBL_154362 (CHEMBL756624)
Ki 700±n/a nM
Citation Thor, MBeierlein, KDykes, GGustavsson, ALHeidrich, JJendeberg, LLindqvist, BPegurier, CRoussel, PSlater, MSvensson, SSydow-Bäckman, MThornström, UUppenberg, J Synthesis and pharmacological evaluation of a new class of peroxisome proliferator-activated receptor modulators. Bioorg Med Chem Lett12:3565-7 (2002) Peroxisome proliferator-activated receptor gamma
Name:Peroxisome proliferator-activated receptor gamma
Type:Nuclear Receptor
Mol. Mass.:57613.46
Organism:Homo sapiens (Human)
Description:P37231
Residue:505
BDBM50121418
NameBDBM50121418
Synonyms:CHEMBL119078 | Lithium; 2-(2,4-dichloro-benzoylamino)-5-quinolin-8-yl-benzoate
TypeSmall organic molecule
Emp. Form.C23H13Cl2N2O3
Mol. Mass.436.267
SMILES[O-]C(=O)c1cc(ccc1NC(=O)c1ccc(Cl)cc1Cl)-c1cccc2cccnc12