Reaction Details
TargetPeroxisome proliferator-activated receptor alpha
LigandBDBM50121412
Substrate/Competitorn/a
Meas. Tech.ChEBML_42430
Ki 30000±n/a nM
Citation Thor, MBeierlein, KDykes, GGustavsson, ALHeidrich, JJendeberg, LLindqvist, BPegurier, CRoussel, PSlater, MSvensson, SSydow-Bäckman, MThornström, UUppenberg, J Synthesis and pharmacological evaluation of a new class of peroxisome proliferator-activated receptor modulators. Bioorg Med Chem Lett12:3565-7 (2002) Peroxisome proliferator-activated receptor alpha
Name:Peroxisome proliferator-activated receptor alpha
Type:Enzyme
Mol. Mass.:52222.08
Organism:Homo sapiens (Human)
Description:Q07869
Residue:468
BDBM50121412
NameBDBM50121412
Synonyms:2-(2,4-Dichloro-benzoylamino)-5-methyl-benzoic acid | CHEMBL118972
TypeSmall organic molecule
Emp. Form.C15H11Cl2NO3
Mol. Mass.324.159
SMILESCc1ccc(NC(=O)c2ccc(Cl)cc2Cl)c(c1)C(O)=O