Reaction Details
TargetPeroxisome proliferator-activated receptor gamma
LigandBDBM50121421
Substrate/Competitorn/a
Meas. Tech.ChEMBL_154362 (CHEMBL756624)
Ki 180±n/a nM
Citation Thor, MBeierlein, KDykes, GGustavsson, ALHeidrich, JJendeberg, LLindqvist, BPegurier, CRoussel, PSlater, MSvensson, SSydow-Bäckman, MThornström, UUppenberg, J Synthesis and pharmacological evaluation of a new class of peroxisome proliferator-activated receptor modulators. Bioorg Med Chem Lett12:3565-7 (2002) Peroxisome proliferator-activated receptor gamma
Name:Peroxisome proliferator-activated receptor gamma
Type:Nuclear Receptor
Mol. Mass.:57613.46
Organism:Homo sapiens (Human)
Description:P37231
Residue:505
BDBM50121421
NameBDBM50121421
Synonyms:CHEMBL118546 | Lithium; 2-(2,4-dichloro-benzoylamino)-5-(5-nitro-pyridin-2-yloxy)-benzoate
TypeSmall organic molecule
Emp. Form.C19H10Cl2N3O6
Mol. Mass.447.206
SMILES[O-]C(=O)c1cc(Oc2ccc(cn2)[N+]([O-])=O)ccc1NC(=O)c1ccc(Cl)cc1Cl