Reaction Details
TargetPeroxisome proliferator-activated receptor gamma
LigandBDBM50121424
Substrate/Competitorn/a
Meas. Tech.ChEBML_154362
Ki 160±n/a nM
Citation Thor, MBeierlein, KDykes, GGustavsson, ALHeidrich, JJendeberg, LLindqvist, BPegurier, CRoussel, PSlater, MSvensson, SSydow-Bäckman, MThornström, UUppenberg, J Synthesis and pharmacological evaluation of a new class of peroxisome proliferator-activated receptor modulators. Bioorg Med Chem Lett12:3565-7 (2002) Peroxisome proliferator-activated receptor gamma
Name:Peroxisome proliferator-activated receptor gamma
Type:Nuclear Receptor
Mol. Mass.:57613.46
Organism:Homo sapiens (Human)
Description:P37231
Residue:505
BDBM50121424
NameBDBM50121424
Synonyms:CHEMBL119111 | Lithium; 5-(6-chloro-pyrazin-2-yloxy)-2-(2,4-dichloro-benzoylamino)-benzoate
TypeSmall organic molecule
Emp. Form.C18H9Cl3N3O4
Mol. Mass.437.641
SMILES[O-]C(=O)c1cc(Oc2cncc(Cl)n2)ccc1NC(=O)c1ccc(Cl)cc1Cl