Reaction Details
TargetPeptide deformylase, mitochondrial
LigandBDBM50121440
Substrate/Competitorn/a
Meas. Tech.ChEMBL_154177 (CHEMBL762381)
IC50 200±n/a nM
Citation Smith, HKBeckett, RPClements, JMDoel, SEast, SPLaunchbury, SBPratt, LMSpavold, ZMThomas, WTodd, RSWhittaker, M Structure-activity relationships of the peptide deformylase inhibitor BB-3497: modification of the metal binding group. Bioorg Med Chem Lett12:3595-9 (2002) Peptide deformylase, mitochondrial
Name:Peptide deformylase, mitochondrial
Type:PROTEIN
Mol. Mass.:27023.25
Organism:Homo sapiens (Human)
Description:ChEMBL_154318
Residue:243
BDBM50121440
NameBDBM50121440
Synonyms:(R)-3-((S)-1-Dimethylcarbamoyl-2,2-dimethyl-propylcarbamoyl)-heptanoic acid | CHEMBL422256
TypeSmall organic molecule
Emp. Form.C16H30N2O4
Mol. Mass.314.4204
SMILESCCCC[C@H](CC(O)=O)C(=O)N[C@H](C(=O)N(C)C)C(C)(C)C