Reaction Details
TargetPeptide deformylase, mitochondrial
LigandBDBM50121443
Substrate/Competitorn/a
Meas. Tech.ChEMBL_154177 (CHEMBL762381)
IC50>1000±n/a nM
Citation Smith, HKBeckett, RPClements, JMDoel, SEast, SPLaunchbury, SBPratt, LMSpavold, ZMThomas, WTodd, RSWhittaker, M Structure-activity relationships of the peptide deformylase inhibitor BB-3497: modification of the metal binding group. Bioorg Med Chem Lett12:3595-9 (2002) Peptide deformylase, mitochondrial
Name:Peptide deformylase, mitochondrial
Type:PROTEIN
Mol. Mass.:27023.25
Organism:Homo sapiens (Human)
Description:ChEMBL_154318
Residue:243
BDBM50121443
NameBDBM50121443
Synonyms:CHEMBL120357 | [2-((S)-1-Dimethylcarbamoyl-2,2-dimethyl-propylcarbamoyl)-hexyl]-phosphonic acid
TypeSmall organic molecule
Emp. Form.C15H31N2O5P
Mol. Mass.350.3908
SMILESCCCCC(CP(O)(O)=O)C(=O)N[C@H](C(=O)N(C)C)C(C)(C)C