Reaction Details
TargetPeptide deformylase, mitochondrial
LigandBDBM50121446
Substrate/Competitorn/a
Meas. Tech.ChEMBL_154177 (CHEMBL762381)
IC50>1000±n/a nM
Citation Smith, HKBeckett, RPClements, JMDoel, SEast, SPLaunchbury, SBPratt, LMSpavold, ZMThomas, WTodd, RSWhittaker, M Structure-activity relationships of the peptide deformylase inhibitor BB-3497: modification of the metal binding group. Bioorg Med Chem Lett12:3595-9 (2002) Peptide deformylase, mitochondrial
Name:Peptide deformylase, mitochondrial
Type:PROTEIN
Mol. Mass.:27023.25
Organism:Homo sapiens (Human)
Description:ChEMBL_154318
Residue:243
BDBM50121446
NameBDBM50121446
Synonyms:(R)-2-Formylaminomethyl-hexanoic acid ((S)-1-dimethylcarbamoyl-2,2-dimethyl-propyl)-amide | CHEMBL325526
TypeSmall organic molecule
Emp. Form.C16H31N3O3
Mol. Mass.313.4356
SMILESCCCC[C@H](CNC=O)C(=O)N[C@H](C(=O)N(C)C)C(C)(C)C