Reaction Details
TargetGonadotropin-releasing hormone receptor
LigandBDBM50121471
Substrate/Competitorn/a
Meas. Tech.ChEBML_71752
Ki 1490±n/a nM
Citation Luthin, DRHong, YTompkins, EAnderes, KLPaderes, GKraynov, EACastro, MANared-Hood, KDCastillo, RGregory, MVazir, HMay, JMAnderson, MB Characterization of mono- and diaminopyrimidine derivatives as novel, nonpeptide gonadotropin releasing hormone (GnRH) receptor antagonists. Bioorg Med Chem Lett12:3635-9 (2002) Gonadotropin-releasing hormone receptor
Name:Gonadotropin-releasing hormone receptor
Type:PROTEIN
Mol. Mass.:37767.60
Organism:Rattus norvegicus
Description:ChEMBL_1335047
Residue:327
BDBM50121471
NameBDBM50121471
Synonyms:5-(3,5,5,8,8-Pentamethyl-5,6,7,8-tetrahydro-naphthalen-2-ylmethyl)-furan-2-carboxylic acid {4-[(4-amino-5-cyano-pyrimidin-2-ylamino)-methyl]-cyclohexylmethyl}-amide | CHEMBL331087
TypeSmall organic molecule
Emp. Form.C34H44N6O2
Mol. Mass.568.7522
SMILESCc1cc2c(cc1Cc1ccc(o1)C(=O)NCC1CCC(CNc3ncc(C#N)c(N)n3)CC1)C(C)(C)CCC2(C)C