Reaction Details
TargetGonadotropin-releasing hormone receptor
LigandBDBM50121482
Substrate/Competitorn/a
Meas. Tech.ChEBML_71600
Ki 220±n/a nM
Citation Luthin, DRHong, YTompkins, EAnderes, KLPaderes, GKraynov, EACastro, MANared-Hood, KDCastillo, RGregory, MVazir, HMay, JMAnderson, MB Characterization of mono- and diaminopyrimidine derivatives as novel, nonpeptide gonadotropin releasing hormone (GnRH) receptor antagonists. Bioorg Med Chem Lett12:3635-9 (2002) Gonadotropin-releasing hormone receptor
Name:Gonadotropin-releasing hormone receptor
Type:Enzyme
Mol. Mass.:37749.45
Organism:Homo sapiens (Human)
Description:P30968
Residue:328
BDBM50121482
NameBDBM50121482
Synonyms:5-(3,5,5,8,8-Pentamethyl-5,6,7,8-tetrahydro-naphthalen-2-ylmethyl)-furan-2-carboxylic acid 3-[(5-fluoro-4-methyl-pyrimidin-2-ylamino)-methyl]-benzylamide | CHEMBL120397
TypeSmall organic molecule
Emp. Form.C33H38FN5O2
Mol. Mass.555.6855
SMILESCc1cc2c(cc1Cc1ccc(o1)C(=O)NCc1cccc(CNc3ncc(F)c(N)n3)c1)C(C)(C)CCC2(C)C