Reaction Details
TargetGonadotropin-releasing hormone receptor
LigandBDBM50121487
Substrate/Competitorn/a
Meas. Tech.ChEBML_71600
Ki 300±n/a nM
Citation Luthin, DRHong, YTompkins, EAnderes, KLPaderes, GKraynov, EACastro, MANared-Hood, KDCastillo, RGregory, MVazir, HMay, JMAnderson, MB Characterization of mono- and diaminopyrimidine derivatives as novel, nonpeptide gonadotropin releasing hormone (GnRH) receptor antagonists. Bioorg Med Chem Lett12:3635-9 (2002) Gonadotropin-releasing hormone receptor
Name:Gonadotropin-releasing hormone receptor
Type:Enzyme
Mol. Mass.:37749.45
Organism:Homo sapiens (Human)
Description:P30968
Residue:328
BDBM50121487
NameBDBM50121487
Synonyms:5-(3,5,5,8,8-Pentamethyl-5,6,7,8-tetrahydro-naphthalen-2-ylmethyl)-furan-2-carboxylic acid {4-[(4,6-dimethoxy-pyrimidin-2-ylamino)-methyl]-cyclohexylmethyl}-amide | CHEMBL333349
TypeSmall organic molecule
Emp. Form.C35H48N4O4
Mol. Mass.588.78
SMILESCOc1cc(OC)nc(NCC2CCC(CNC(=O)c3ccc(Cc4cc5c(cc4C)C(C)(C)CCC5(C)C)o3)CC2)n1