Reaction Details
TargetCathepsin S
LigandBDBM50121562
Substrate/Competitorn/a
Meas. Tech.ChEMBL_48672 (CHEMBL658343)
IC50 5±n/a nM
Citation Ward, YDThomson, DSFrye, LLCywin, CLMorwick, TEmmanuel, MJZindell, RMcNeil, DBekkali, YGirardot, MHrapchak, MDeTuri, MCrane, KWhite, DPav, SWang, YHao, MHGrygon, CALabadia, MEFreeman, DMDavidson, WHopkins, JLBrown, MLSpero, DMGiradot, M Design and synthesis of dipeptide nitriles as reversible and potent Cathepsin S inhibitors. J Med Chem45:5471-82 (2002) Cathepsin S
Name:Cathepsin S
Type:Protein
Mol. Mass.:37507.38
Organism:Homo sapiens (Human)
Description:P25774
Residue:331
BDBM50121562
NameBDBM50121562
Synonyms:CHEMBL153239 | Morpholine-4-carboxylic acid [1-(1-cyano-3-phenyl-propylcarbamoyl)-2-cyclohexyl-ethyl]-amide
TypeSmall organic molecule
Emp. Form.C24H34N4O3
Mol. Mass.426.5518
SMILESO=C(N[C@@H](CCc1ccccc1)C#N)[C@H](CC1CCCCC1)NC(=O)N1CCOCC1