Reaction Details
TargetEstrogen receptor
LigandBDBM50121589
Substrate/Competitorn/a
Meas. Tech.ChEMBL_67518 (CHEMBL682301)
Ki 395±n/a nM
Citation Henke, BRConsler, TGGo, NHale, RLHohman, DRJones, SALu, ATMoore, LBMoore, JTOrband-Miller, LARobinett, RGShearin, JSpearing, PKStewart, ELTurnbull, PSWeaver, SLWilliams, SPWisely, GBLambert, MH A new series of estrogen receptor modulators that display selectivity for estrogen receptor beta. J Med Chem45:5492-505 (2002) Estrogen receptor
Name:Estrogen receptor
Type:Protein
Mol. Mass.:66230.44
Organism:Homo sapiens (Human)
Description:P03372
Residue:595
BDBM50121589
NameBDBM50121589
Synonyms:4-(2-{4-{[3-(4-Chloro-phenyl)-propyl]-methyl-amino}-6-[4-(2-hydroxy-ethyl)-piperazin-1-yl]-[1,3,5]triazin-2-ylamino}-ethyl)-phenol | CHEMBL347560
TypeSmall organic molecule
Emp. Form.C27H36ClN7O2
Mol. Mass.526.073
SMILESCN(CCCc1ccc(Cl)cc1)c1nc(NCCc2ccc(O)cc2)nc(n1)N1CCN(CCO)CC1