Reaction Details
TargetEstrogen receptor
LigandBDBM50121587
Substrate/Competitorn/a
Meas. Tech.ChEMBL_67355 (CHEMBL676810)
EC50 500±n/a nM
Citation Henke, BRConsler, TGGo, NHale, RLHohman, DRJones, SALu, ATMoore, LBMoore, JTOrband-Miller, LARobinett, RGShearin, JSpearing, PKStewart, ELTurnbull, PSWeaver, SLWilliams, SPWisely, GBLambert, MH A new series of estrogen receptor modulators that display selectivity for estrogen receptor beta. J Med Chem45:5492-505 (2002) Estrogen receptor
Name:Estrogen receptor
Type:Protein
Mol. Mass.:66230.44
Organism:Homo sapiens (Human)
Description:P03372
Residue:595
BDBM50121587
NameBDBM50121587
Synonyms:CHEMBL153395 | cis-4-(2-{4-[Methyl-(2-phenyl-cyclopropylmethyl)-amino]-6-piperazin-1-yl-[1,3,5]triazin-2-ylamino}-ethyl)-phenol
TypeSmall organic molecule
Emp. Form.C26H33N7O
Mol. Mass.459.5865
SMILESCN(C[C@@H]1C[C@@H]1c1ccccc1)c1nc(NCCc2ccc(O)cc2)nc(n1)N1CCNCC1