Reaction Details
TargetMu-type opioid receptor
LigandBDBM50121638
Substrate/Competitorn/a
Meas. Tech.ChEMBL_148854 (CHEMBL756650)
Ki 0.76±n/a nM
Citation Bryant, SDGeorge, CFlippen-Anderson, JLDeschamps, JRSalvadori, SBalboni, GGuerrini, RLazarus, LH Crystal structures of dipeptides containing the Dmt-Tic pharmacophore. J Med Chem45:5506-13 (2002) Mu-type opioid receptor
Name:Mu-type opioid receptor
Type:G Protein-Coupled Receptor (GPCR)
Mol. Mass.:44503.11
Organism:Rattus norvegicus (rat)
Description:Competition binding assays were carried out using membrane preparations from transfected HN9.10 cells that constitutively expressed the mu opioid receptor.
Residue:398
BDBM50121638
NameBDBM50121638
Synonyms:1-[3-(Adamantan-1-ylamino)-3,4-dihydro-1H-isoquinolin-2-yl]-2-amino-3-(4-hydroxy-2,6-dimethyl-phenyl)-propan-1-one | CHEMBL422855
TypeSmall organic molecule
Emp. Form.C30H39N3O2
Mol. Mass.473.6496
SMILESCc1cc(O)cc(C)c1C[C@H](N)C(=O)N1Cc2ccccc2CC1NC12CC3CC(CC(C3)C1)C2