Reaction Details
TargetGag-Pol polyprotein [489-587]
LigandBDBM50121732
Substrate/Competitorn/a
Meas. Tech.ChEBML_79946
Ki 0.470000±n/a nM
Citation Hidaka, KKimura, THayashi, YMcDaniel, KFDekhtyar, TColletti, LKiso, Y Design and synthesis of pseudo-symmetric HIV protease inhibitors containing a novel hydroxymethylcarbonyl (HMC)-hydrazide isostere. Bioorg Med Chem Lett13:93-6 (2002) Gag-Pol polyprotein [489-587]
Name:Gag-Pol polyprotein [489-587]
Type:Enzyme Subunit
Mol. Mass.:10781.16
Organism:Human immunodeficiency virus type 1
Description:P04585[489-587]
Residue:99
BDBM50121732
NameBDBM50121732
Synonyms:CHEMBL172850 | {1-[(S)-3-[N-Benzyl-N'-(3-hydroxy-2-methyl-benzoyl)-hydrazino]-2-hydroxy-3-oxo-1-((S)-phenylmethyl)-propylcarbamoyl]-2-methylsulfanyl-ethyl}-carbamic acid isoquinolin-5-ylmethyl ester
TypeSmall organic molecule
Emp. Form.C40H41N5O7S
Mol. Mass.735.848
SMILESCSC[C@H](NC(=O)OCc1cccc2cnccc12)C(=O)N[C@@H](Cc1ccccc1)[C@H](O)C(=O)N(Cc1ccccc1)NC(=O)c1cccc(O)c1C