Reaction Details
TargetC-C chemokine receptor type 5
LigandBDBM50121838
Substrate/Competitorn/a
Meas. Tech.ChEBML_49693
IC50 0.060000±n/a nM
Citation Lynch, CLWilloughby, CAHale, JJHolson, EJBudhu, RJGentry, ALRosauer, KGCaldwell, CGChen, PMills, SGMacCoss, MBerk, SChen, LChapman, KTMalkowitz, LSpringer, MSGould, SLDeMartino, JASiciliano, SJCascieri, MACarella, ACarver, GHolmes, KSchleif, WADanzeisen, RHazuda, DKessler, JLineberger, JMiller, MEmini, EA 1,3,4-Trisubstituted pyrrolidine CCR5 receptor antagonists: modifications of the arylpropylpiperidine side chains. Bioorg Med Chem Lett13:119-23 (2002) C-C chemokine receptor type 5
Name:C-C chemokine receptor type 5
Type:Enzyme
Mol. Mass.:40540.21
Organism:Homo sapiens (Human)
Description:P51681
Residue:352
BDBM50121838
NameBDBM50121838
Synonyms:(R)-3-cyclopropyl-2-((3S,4S)-3-((4-(3,3-difluoro-3-(4-fluorophenyl)propyl)piperidin-1-yl)methyl)-4-(3-fluorophenyl)pyrrolidin-1-yl)propanoic acid CHEMBL21106
TypeSmall organic molecule
Emp. Form.C31H38F4N2O2
Mol. Mass.546.6392
SMILESOC(=O)[C@@H](CC1CC1)N1C[C@H](CN2CCC(CCC(F)(F)c3ccc(F)cc3)CC2)[C@H](C1)c1cccc(F)c1