Reaction Details
TargetNeutrophil elastase
LigandBDBM50121907
Substrate/Competitorn/a
Meas. Tech.ChEBML_96629
IC50>50000±n/a nM
Citation Zhou, NEGuo, DThomas, GReddy, AVKaleta, JPurisima, EMenard, RMicetich, RGSingh, R 3-Acylamino-azetidin-2-one as a novel class of cysteine proteases inhibitors. Bioorg Med Chem Lett13:139-41 (2002) Neutrophil elastase
Name:Neutrophil elastase
Type:Enzyme
Mol. Mass.:28532.38
Organism:Homo sapiens (Human)
Description:P08246
Residue:267
BDBM50121907
NameBDBM50121907
Synonyms:CHEMBL31788 | [(S)-1-((3R,4S)-2-Oxo-4-phenylsulfanyl-azetidin-3-ylcarbamoyl)-2-phenyl-ethyl]-carbamic acid benzyl ester
TypeSmall organic molecule
Emp. Form.C26H25N3O4S
Mol. Mass.475.559
SMILESO=C(N[C@@H](Cc1ccccc1)C(=O)N[C@H]1[C@@H](NC1=O)Sc1ccccc1)OCc1ccccc1