Reaction Details
TargetCathepsin S
LigandBDBM50121905
Substrate/Competitorn/a
Meas. Tech.ChEBML_48668
IC50>2500±n/a nM
Citation Zhou, NEGuo, DThomas, GReddy, AVKaleta, JPurisima, EMenard, RMicetich, RGSingh, R 3-Acylamino-azetidin-2-one as a novel class of cysteine proteases inhibitors. Bioorg Med Chem Lett13:139-41 (2002) Cathepsin S
Name:Cathepsin S
Type:Protein
Mol. Mass.:37507.38
Organism:Homo sapiens (Human)
Description:P25774
Residue:331
BDBM50121905
NameBDBM50121905
Synonyms:CHEMBL284984 | [(S)-1-((2S,3S)-2-Benzyloxy-4-oxo-azetidin-3-ylcarbamoyl)-2-phenyl-ethyl]-carbamic acid benzyl ester
TypeSmall organic molecule
Emp. Form.C27H27N3O5
Mol. Mass.473.5204
SMILESO=C(N[C@@H](Cc1ccccc1)C(=O)N[C@H]1[C@@H](NC1=O)OCc1ccccc1)OCc1ccccc1