Reaction Details
TargetNeutrophil elastase
LigandBDBM50121911
Substrate/Competitorn/a
Meas. Tech.ChEBML_96629
IC50>50000±n/a nM
Citation Zhou, NEGuo, DThomas, GReddy, AVKaleta, JPurisima, EMenard, RMicetich, RGSingh, R 3-Acylamino-azetidin-2-one as a novel class of cysteine proteases inhibitors. Bioorg Med Chem Lett13:139-41 (2002) Neutrophil elastase
Name:Neutrophil elastase
Type:Enzyme
Mol. Mass.:28532.38
Organism:Homo sapiens (Human)
Description:P08246
Residue:267
BDBM50121911
NameBDBM50121911
Synonyms:Benzoic acid (2S,3S)-3-((S)-2-benzyloxycarbonylamino-3-phenyl-propionylamino)-4-oxo-azetidin-2-yl ester | CHEMBL285585
TypeSmall organic molecule
Emp. Form.C27H25N3O6
Mol. Mass.487.5039
SMILESO=C(N[C@@H](Cc1ccccc1)C(=O)N[C@H]1[C@@H](NC1=O)OC(=O)c1ccccc1)OCc1ccccc1