Reaction Details
TargetCathepsin S
LigandBDBM50121913
Substrate/Competitorn/a
Meas. Tech.ChEBML_48668
IC50>5000±n/a nM
Citation Zhou, NEGuo, DThomas, GReddy, AVKaleta, JPurisima, EMenard, RMicetich, RGSingh, R 3-Acylamino-azetidin-2-one as a novel class of cysteine proteases inhibitors. Bioorg Med Chem Lett13:139-41 (2002) Cathepsin S
Name:Cathepsin S
Type:Protein
Mol. Mass.:37507.38
Organism:Homo sapiens (Human)
Description:P25774
Residue:331
BDBM50121913
NameBDBM50121913
Synonyms:CHEMBL281518 | [(S)-1-((R)-2-Oxo-azetidin-3-ylcarbamoyl)-2-phenyl-ethyl]-carbamic acid benzyl ester
TypeSmall organic molecule
Emp. Form.C20H21N3O4
Mol. Mass.367.3984
SMILESO=C(N[C@@H](Cc1ccccc1)C(=O)N[C@@H]1CNC1=O)OCc1ccccc1