Reaction Details
TargetCathepsin B
LigandBDBM50121904
Substrate/Competitorn/a
Meas. Tech.ChEBML_47599
IC50 430.0±n/a nM
Citation Zhou, NEGuo, DThomas, GReddy, AVKaleta, JPurisima, EMenard, RMicetich, RGSingh, R 3-Acylamino-azetidin-2-one as a novel class of cysteine proteases inhibitors. Bioorg Med Chem Lett13:139-41 (2002) Cathepsin B
Name:Cathepsin B
Type:Protein
Mol. Mass.:37463.53
Organism:Rattus norvegicus
Description:P00787
Residue:339
BDBM50121904
NameBDBM50121904
Synonyms:CHEMBL30401 | [(S)-1-((3S,4R)-2-Oxo-4-phenoxy-azetidin-3-ylcarbamoyl)-2-phenyl-ethyl]-carbamic acid benzyl ester
TypeSmall organic molecule
Emp. Form.C26H25N3O5
Mol. Mass.459.4938
SMILESO=C(N[C@@H](Cc1ccccc1)C(=O)N[C@H]1[C@H](NC1=O)Oc1ccccc1)OCc1ccccc1