Reaction Details
TargetNeutrophil elastase
LigandBDBM50121914
Substrate/Competitorn/a
Meas. Tech.ChEBML_96629
IC50>50000±n/a nM
Citation Zhou, NEGuo, DThomas, GReddy, AVKaleta, JPurisima, EMenard, RMicetich, RGSingh, R 3-Acylamino-azetidin-2-one as a novel class of cysteine proteases inhibitors. Bioorg Med Chem Lett13:139-41 (2002) Neutrophil elastase
Name:Neutrophil elastase
Type:Enzyme
Mol. Mass.:28532.38
Organism:Homo sapiens (Human)
Description:P08246
Residue:267
BDBM50121914
NameBDBM50121914
Synonyms:CHEMBL281672 | [(S)-1-((S)-2-Oxo-azetidin-3-ylcarbamoyl)-2-phenyl-ethyl]-carbamic acid benzyl ester
TypeSmall organic molecule
Emp. Form.C20H21N3O4
Mol. Mass.367.3984
SMILESO=C(N[C@@H](Cc1ccccc1)C(=O)N[C@H]1CNC1=O)OCc1ccccc1