Reaction Details
TargetProcathepsin L
LigandBDBM50121901
Substrate/Competitorn/a
Meas. Tech.ChEBML_48362
IC50 42±n/a nM
Citation Zhou, NEGuo, DThomas, GReddy, AVKaleta, JPurisima, EMenard, RMicetich, RGSingh, R 3-Acylamino-azetidin-2-one as a novel class of cysteine proteases inhibitors. Bioorg Med Chem Lett13:139-41 (2002) Procathepsin L
Name:Procathepsin L
Type:Enzyme
Mol. Mass.:37557.19
Organism:Homo sapiens (Human)
Description:Purchased from Calbiochem (San Diego, CA).
Residue:333
BDBM50121901
NameBDBM50121901
Synonyms:Acetic acid (2S,3S)-3-((S)-2-benzyloxycarbonylamino-3-phenyl-propionylamino)-4-oxo-azetidin-2-yl ester | CHEMBL417303
TypeSmall organic molecule
Emp. Form.C22H23N3O6
Mol. Mass.425.4345
SMILESCC(=O)O[C@@H]1NC(=O)[C@H]1NC(=O)[C@H](Cc1ccccc1)NC(=O)OCc1ccccc1