Reaction Details
TargetKappa-type opioid receptor
LigandBDBM50121932
Substrate/Competitorn/a
Meas. Tech.ChEMBL_145255 (CHEMBL751033)
Ki 6.6±n/a nM
Citation Bennett, MAMurray, TFAldrich, JV Identification of arodyn, a novel acetylated dynorphin A-(1-11) analogue, as a kappa opioid receptor antagonist. J Med Chem45:5617-9 (2002) Kappa-type opioid receptor
Name:Kappa-type opioid receptor
Type:G Protein-Coupled Receptor (GPCR)
Mol. Mass.:42648.76
Organism:Homo sapiens (Human)
Description:P41145
Residue:380
BDBM50121932
NameBDBM50121932
Synonyms:Ac-Arg-Phe-Met-Trp-Met-Arg-Arg-D-Ala-Arg-Pro-Lys-NH2 | CHEMBL266538
TypeSmall organic molecule
Emp. Form.C70H114N26O12S2
Mol. Mass.1575.951
SMILESCSCC[C@H](NC(=O)[C@H](Cc1c[nH]c2ccccc12)NC(=O)[C@H](CCSC)NC(=O)[C@H](Cc1ccccc1)NC(=O)[C@H](CCCNC(N)=N)NC(C)=O)C(=O)N[C@@H](CCCNC(N)=N)C(=O)N[C@@H](CCCNC(N)=N)C(=O)N[C@@H](C)C(=O)N[C@@H](CCCNC(N)=N)C(=O)N1CCC[C@H]1C(=O)N[C@@H](CCCCN)C(N)=O