Reaction Details
TargetIntegrin alpha-V/beta-3
LigandBDBM50092511
Substrate/Competitorn/a
Meas. Tech.ChEMBL_214640 (CHEMBL819720)
IC50 0.08±n/a nM
Citation Feuston, BPCulberson, JCDuggan, MEHartman, GDLeu, CTRodan, SB Binding model for nonpeptide antagonists of alpha(v)beta(3) integrin. J Med Chem45:5640-8 (2002) Integrin alpha-V/beta-3
Name:Integrin alpha-V/beta-3
Type:Enzyme
Mol. Mass.:n/a
Description:n/a
Components:This complex has 2 components.
Component 1
Name:Integrin alpha-V
Synonyms:ITAV_HUMAN Integrin alpha-V/alpha-5 VNRA Vitronectin receptor | Vitronectin receptor subunit alpha
Type:PROTEIN
Mol. Mass.:116024.92
Organism:Homo sapiens (Human)
Description:ChEMBL_582336
Residue:1048
Component 2
Name:Integrin beta-3
Synonyms:CD_antigen=CD61 GPIIIa ITGB3 Platelet membrane glycoprotein IIIa
Type:Protein
Mol. Mass.:87038.91
Organism:Homo sapiens (Human)
Description:P05106
Residue:788
BDBM50092511
NameBDBM50092511
Synonyms:3-{4-[2-(6-Amino-pyridin-2-yl)-ethyl]-benzoylamino}-2-(4-iodo-benzenesulfonylamino)-propionic acid | CHEMBL332914
TypeSmall organic molecule
Emp. Form.C23H23IN4O5S
Mol. Mass.594.422
SMILESNc1cccc(CCc2ccc(cc2)C(=O)NC[C@H](NS(=O)(=O)c2ccc(I)cc2)C(O)=O)n1