Reaction Details
TargetReverse transcriptase/RNaseH
LigandBDBM50121970
Substrate/Competitorn/a
Meas. Tech.ChEMBL_195519 (CHEMBL800587)
IC50>100000±n/a nM
Citation Neamati, NLin, ZKarki, RGOrr, ACowansage, KStrumberg, DPais, GCVoigt, JHNicklaus, MCWinslow, HEZhao, HTurpin, JAYi, JSkalka, AMBurke, TRPommier, Y Metal-dependent inhibition of HIV-1 integrase. J Med Chem45:5661-70 (2002) Reverse transcriptase/RNaseH
Name:Reverse transcriptase/RNaseH
Type:PROTEIN
Mol. Mass.:65229.15
Organism:Human immunodeficiency virus 1
Description:ChEMBL_1473730
Residue:566
BDBM50121970
NameBDBM50121970
Synonyms:11,12,13,14,25,26,27,28-octahydrotetrabenzo[c,i,m,s][1,2,11,12,6,7,16,17]tetrathiatetraazacycloicosine-11,14,25,28-tetraone | CHEMBL152850
TypeSmall organic molecule
Emp. Form.C28H20N4O4S4
Mol. Mass.604.743
SMILESO=C1NNC(=O)c2ccccc2SSc2ccccc2C(=O)NNC(=O)c2ccccc2SSc2ccccc12