Reaction Details
TargetIntegrase
LigandBDBM50121971
Substrate/Competitorn/a
Meas. Tech.ChEMBL_90735 (CHEMBL701286)
IC50 18000±n/a nM
Citation Neamati, NLin, ZKarki, RGOrr, ACowansage, KStrumberg, DPais, GCVoigt, JHNicklaus, MCWinslow, HEZhao, HTurpin, JAYi, JSkalka, AMBurke, TRPommier, Y Metal-dependent inhibition of HIV-1 integrase. J Med Chem45:5661-70 (2002) Integrase
Name:Integrase
Synonyms:Human immunodeficiency virus type 1 integrase
Type:PROTEIN
Mol. Mass.:32231.48
Organism:Human immunodeficiency virus 1
Description:ChEMBL_90865
Residue:288
BDBM50121971
NameBDBM50121971
TypeSmall organic molecule
Emp. Form.C14H12N2O2S2
Mol. Mass.304.387
SMILESSc1ccccc1C(=O)NNC(=O)c1ccccc1S