Reaction Details
TargetGag-Pol polyprotein [489-587]
LigandBDBM50121971
Substrate/Competitorn/a
Meas. Tech.ChEMBL_159619 (CHEMBL760100)
IC50>100000±n/a nM
Citation Neamati, NLin, ZKarki, RGOrr, ACowansage, KStrumberg, DPais, GCVoigt, JHNicklaus, MCWinslow, HEZhao, HTurpin, JAYi, JSkalka, AMBurke, TRPommier, Y Metal-dependent inhibition of HIV-1 integrase. J Med Chem45:5661-70 (2002) Gag-Pol polyprotein [489-587]
Name:Gag-Pol polyprotein [489-587]
Type:Enzyme Subunit
Mol. Mass.:10781.16
Organism:Human immunodeficiency virus type 1
Description:P04585[489-587]
Residue:99
BDBM50121971
NameBDBM50121971
Synonyms:2-Mercapto-benzoic acid N'-(2-mercapto-benzoyl)-hydrazide bis(thiosalicyl)hydrazide
TypeSmall organic molecule
Emp. Form.C14H12N2O2S2
Mol. Mass.304.387
SMILESSc1ccccc1C(=O)NNC(=O)c1ccccc1S