Reaction Details
TargetIntegrase
LigandBDBM50121972
Substrate/Competitorn/a
Meas. Tech.ChEMBL_90737 (CHEMBL701288)
IC50 11000±n/a nM
Citation Neamati, NLin, ZKarki, RGOrr, ACowansage, KStrumberg, DPais, GCVoigt, JHNicklaus, MCWinslow, HEZhao, HTurpin, JAYi, JSkalka, AMBurke, TRPommier, Y Metal-dependent inhibition of HIV-1 integrase. J Med Chem45:5661-70 (2002) Integrase
Name:Integrase
Synonyms:Human immunodeficiency virus type 1 integrase
Type:PROTEIN
Mol. Mass.:32231.48
Organism:Human immunodeficiency virus 1
Description:ChEMBL_90865
Residue:288
BDBM50121972
NameBDBM50121972
TypeSmall organic molecule
Emp. Form.C28H22N4O4S4
Mol. Mass.606.759
SMILESSc1ccccc1C(=O)NNC(=O)c1ccccc1SSc1ccccc1C(=O)NNC(=O)c1ccccc1S