Reaction Details
TargetReverse transcriptase/RNaseH
LigandBDBM50121971
Substrate/Competitorn/a
Meas. Tech.ChEMBL_195518 (CHEMBL800586)
IC50>100000±n/a nM
Citation Neamati, NLin, ZKarki, RGOrr, ACowansage, KStrumberg, DPais, GCVoigt, JHNicklaus, MCWinslow, HEZhao, HTurpin, JAYi, JSkalka, AMBurke, TRPommier, Y Metal-dependent inhibition of HIV-1 integrase. J Med Chem45:5661-70 (2002) Reverse transcriptase/RNaseH
Name:Reverse transcriptase/RNaseH
Type:PROTEIN
Mol. Mass.:65229.15
Organism:Human immunodeficiency virus 1
Description:ChEMBL_1473730
Residue:566
BDBM50121971
NameBDBM50121971
Synonyms:2-Mercapto-benzoic acid N'-(2-mercapto-benzoyl)-hydrazide bis(thiosalicyl)hydrazide
TypeSmall organic molecule
Emp. Form.C14H12N2O2S2
Mol. Mass.304.387
SMILESSc1ccccc1C(=O)NNC(=O)c1ccccc1S