Reaction Details
TargetIntegrase
LigandBDBM50121970
Substrate/Competitorn/a
Meas. Tech.ChEMBL_90861 (CHEMBL699296)
IC50 5000±n/a nM
Citation Neamati, NLin, ZKarki, RGOrr, ACowansage, KStrumberg, DPais, GCVoigt, JHNicklaus, MCWinslow, HEZhao, HTurpin, JAYi, JSkalka, AMBurke, TRPommier, Y Metal-dependent inhibition of HIV-1 integrase. J Med Chem45:5661-70 (2002) Integrase
Name:Integrase
Synonyms:Human immunodeficiency virus type 1 integrase
Type:PROTEIN
Mol. Mass.:32231.48
Organism:Human immunodeficiency virus 1
Description:ChEMBL_90865
Residue:288
BDBM50121970
NameBDBM50121970
TypeSmall organic molecule
Emp. Form.C28H20N4O4S4
Mol. Mass.604.743
SMILESO=C1NNC(=O)c2ccccc2SSc2ccccc2C(=O)NNC(=O)c2ccccc2SSc2ccccc12