Reaction Details
TargetGamma-aminobutyric acid receptor subunit alpha-1/beta-2/gamma-2
LigandBDBM50000766
Substrate/Competitorn/a
Meas. Tech.ChEMBL_69937 (CHEMBL679467)
Ki 14±n/a nM
Citation Costanzo, AGuerrini, GCiciani, GBruni, FCostagli, CSelleri, SBesnard, FCosta, BMartini, CMalmberg-Aiello, P Benzodiazepine receptor ligands. 7. Synthesis and pharmacological evaluation of new 3-esters of the 8-chloropyrazolo[5,1-c][1,2,4]benzotriazine 5-oxide. 3-(2-Thienylmethoxycarbonyl) derivative: an anxioselective agent in rodents. J Med Chem45:5710-20 (2002) Gamma-aminobutyric acid receptor subunit alpha-1/beta-2/gamma-2
Name:Gamma-aminobutyric acid receptor subunit alpha-1/beta-2/gamma-2
Type:n/a
Mol. Mass.:n/a
Description:ASSAY_ID of EBI is 69455
Components:This complex has 3 components.
Component 1
Name:Gamma-aminobutyric acid receptor subunit beta-2
Synonyms:GBRB2_RAT Gabrb2 | Gamma-aminobutyric acid receptor subunit beta-2 (GABA(A) beta-2)
Type:Enzyme
Mol. Mass.:54648.97
Organism:Rattus norvegicus (Rat)
Description:P63138
Residue:474
Component 2
Name:Gamma-aminobutyric acid receptor subunit gamma-2
Synonyms:GBRG2_RAT Gamma-aminobutyric acid receptor subunit gamma-2 (GABA(A) gamma-2)
Type:Enzyme
Mol. Mass.:54087.63
Organism:Rattus norvegicus (Rat)
Description:P18508
Residue:466
Component 3
Name:Gamma-aminobutyric acid receptor subunit alpha-1
Synonyms:Benzodiazepine central GABA A Benzodiazepine GABA A Benzodiazepine Type II GABA A Benzodiazepine Type IIM GABA A Benzodiazepine omega2 GABA A alpha1 GABA receptor alpha-1 subunit GABA-PICROTOXIN Gabra-1 TBPS
Type:Enzyme
Mol. Mass.:51770.21
Organism:Rattus norvegicus (Rat)
Description:P62813
Residue:455
BDBM50000766
NameBDBM50000766
Synonyms:CHEMBL12 US9271961, Diazepam
TypeSmall organic molecule
Emp. Form.C16H13ClN2O
Mol. Mass.284.74
SMILESCN1c2ccc(Cl)cc2C(=NCC1=O)c1ccccc1