Reaction Details
TargetGlutamate receptor 1
LigandBDBM50122088
Substrate/Competitorn/a
Meas. Tech.ChEMBL_72845 (CHEMBL680870)
Ki 22000±n/a nM
Citation Kromann, HKrikstolaityte, SAndersen, AJAndersen, KKrogsgaard-Larsen, PJaroszewski, JWEgebjerg, JStrømgaard, K Solid-phase synthesis of polyamine toxin analogues: potent and selective antagonists of Ca2+-permeable AMPA receptors. J Med Chem45:5745-54 (2002) Glutamate receptor 1
Name:Glutamate receptor 1
Type:Enzyme Catalytic Domain
Mol. Mass.:101512.92
Organism:Homo sapiens (Human)
Description:Glutamate AMPA 1 GRIA1 HUMAN::P42261
Residue:906
BDBM50122088
NameBDBM50122088
Synonyms:CHEMBL55975 | N-[1-{3-[4-(3-Amino-propylamino)-butylamino]-propylcarbamoyl}-2-(4-hydroxy-phenyl)-ethyl]-butyramide
TypeSmall organic molecule
Emp. Form.C23H41N5O3
Mol. Mass.435.6033
SMILESCCCC(=O)NC(Cc1ccc(O)cc1)C(=O)NCCCNCCCCNCCCN