Reaction Details
TargetGlutamate receptor 1
LigandBDBM50122080
Substrate/Competitorn/a
Meas. Tech.ChEMBL_72845 (CHEMBL680870)
Ki 468±n/a nM
Citation Kromann, HKrikstolaityte, SAndersen, AJAndersen, KKrogsgaard-Larsen, PJaroszewski, JWEgebjerg, JStrømgaard, K Solid-phase synthesis of polyamine toxin analogues: potent and selective antagonists of Ca2+-permeable AMPA receptors. J Med Chem45:5745-54 (2002) Glutamate receptor 1
Name:Glutamate receptor 1
Type:Enzyme Catalytic Domain
Mol. Mass.:101512.92
Organism:Homo sapiens (Human)
Description:Glutamate AMPA 1 GRIA1 HUMAN::P42261
Residue:906
BDBM50122080
NameBDBM50122080
Synonyms:CHEMBL152153 | N-[1-[6-(5-Amino-pentylamino)-hexylcarbamoyl]-2-(4-hydroxy-phenyl)-ethyl]-butyramide
TypeSmall organic molecule
Emp. Form.C24H42N4O3
Mol. Mass.434.6153
SMILESCCCC(=O)NC(Cc1ccc(O)cc1)C(=O)NCCCCCCNCCCCCN