Reaction Details
TargetGlucagon receptor
LigandBDBM50122142
Substrate/Competitorn/a
Meas. Tech.ChEMBL_72875 (CHEMBL684126)
IC50 5.8±n/a nM
Citation Madsen, PLing, APlewe, MSams, CKKnudsen, LBSidelmann, UGYnddal, LBrand, CLAndersen, BMurphy, DTeng, MTruesdale, LKiel, DMay, JKuki, AShi, SJohnson, MDTeston, KAFeng, JLakis, JAnderes, KGregor, VLau, J Optimization of alkylidene hydrazide based human glucagon receptor antagonists. Discovery of the highly potent and orally available 3-cyano-4-hydroxybenzoic acid [1-(2,3,5,6-tetramethylbenzyl)-1H-indol-4-ylmethylene]hydrazide. J Med Chem45:5755-75 (2002) Glucagon receptor
Name:Glucagon receptor
Type:Enzyme
Mol. Mass.:54026.92
Organism:Homo sapiens (Human)
Description:P47871
Residue:477
BDBM50122142
NameBDBM50122142
Synonyms:3-Chloro-4-hydroxy-benzoic acid [1-(2,4,6-trimethyl-benzyl)-1H-indol-4-ylmethylene]-hydrazide | CHEMBL152293
TypeSmall organic molecule
Emp. Form.C26H24ClN3O2
Mol. Mass.445.941
SMILESCc1cc(C)c(Cn2ccc3c(\C=N\NC(=O)c4ccc(O)c(Cl)c4)cccc23)c(C)c1