Reaction Details
TargetGlucagon receptor
LigandBDBM50122160
Substrate/Competitorn/a
Meas. Tech.ChEMBL_72875 (CHEMBL684126)
IC50 4.9±n/a nM
Citation Madsen, PLing, APlewe, MSams, CKKnudsen, LBSidelmann, UGYnddal, LBrand, CLAndersen, BMurphy, DTeng, MTruesdale, LKiel, DMay, JKuki, AShi, SJohnson, MDTeston, KAFeng, JLakis, JAnderes, KGregor, VLau, J Optimization of alkylidene hydrazide based human glucagon receptor antagonists. Discovery of the highly potent and orally available 3-cyano-4-hydroxybenzoic acid [1-(2,3,5,6-tetramethylbenzyl)-1H-indol-4-ylmethylene]hydrazide. J Med Chem45:5755-75 (2002) Glucagon receptor
Name:Glucagon receptor
Type:Enzyme
Mol. Mass.:54026.92
Organism:Homo sapiens (Human)
Description:P47871
Residue:477
BDBM50122160
NameBDBM50122160
Synonyms:3-Cyano-4-hydroxy-benzoic acid {4-[4-(4-chloro-benzyl)-piperazine-1-carbonyl]-naphthalen-1-ylmethylene}-hydrazide | CHEMBL154149
TypeSmall organic molecule
Emp. Form.C31H26ClN5O3
Mol. Mass.552.023
SMILESOc1ccc(cc1C#N)C(=O)N\N=C\c1ccc(C(=O)N2CCN(Cc3ccc(Cl)cc3)CC2)c2ccccc12