Reaction Details
TargetProthrombin
LigandBDBM50122190
Substrate/Competitorn/a
Meas. Tech.ChEBML_208491
Ki 0.040000±n/a nM
Citation Sanderson, PECutrona, KJDyer, DLKrueger, JAKuo, LCLewis, SDLucas, BJYan, Y Small, low nanomolar, noncovalent thrombin inhibitors lacking a group to fill the 'distal binding pocket'. Bioorg Med Chem Lett13:161-4 (2002) Prothrombin
Name:Prothrombin
Type:Protein
Mol. Mass.:70029.57
Organism:Homo sapiens (Human)
Description:P00734
Residue:622
BDBM50122190
NameBDBM50122190
Synonyms:CHEMBL296737 | N-(5-chloro-2-ethylcarbamoylmethoxy-benzyl)-2-(6-methyl-2-oxo-3-phenylmethanesulfonylamino-2H-pyridin-1-yl)-acetamide
TypeSmall organic molecule
Emp. Form.C26H29ClN4O6S
Mol. Mass.561.05
SMILESCCNC(=O)COc1ccc(Cl)cc1CNC(=O)Cn1c(C)ccc(NS(=O)(=O)Cc2ccccc2)c1=O