Reaction Details
Target5-hydroxytryptamine receptor 1A
LigandBDBM50122239
Substrate/Competitorn/a
Meas. Tech.ChEMBL_1139 (CHEMBL616084)
Ki 0.820000±n/a nM
Citation Betti, LFloridi, MGiannaccini, GManetti, FStrappaghetti, GTafi, ABotta, M alpha1-Adrenoceptor antagonists. 5. Pyridazinone-arylpiperazines. Probing the influence on affinity and selectivity of both ortho-alkoxy groups at the arylpiperazine moiety and cyclic substituents at the pyridazinone nucleus. Bioorg Med Chem Lett13:171-3 (2002) 5-hydroxytryptamine receptor 1A
Name:5-hydroxytryptamine receptor 1A
Type:G Protein-Coupled Receptor (GPCR)
Mol. Mass.:46445.29
Organism:Rattus norvegicus (rat)
Description:Binding assays were performed using rat hippocampal membranes.
Residue:422
BDBM50122239
NameBDBM50122239
Synonyms:4-Chloro-5-{4-[2-(2-ethoxy-phenoxy)-ethyl]-piperazin-1-yl}-2-{7-[4-(2-isopropoxy-phenyl)-piperazin-1-yl]-heptyl}-2H-pyridazin-3-one CHEMBL300093
TypeSmall organic molecule
Emp. Form.C38H55ClN6O4
Mol. Mass.695.334
SMILESCCOc1ccccc1OCCN1CCN(CC1)c1cnn(CCCCCCCN2CCN(CC2)c2ccccc2OC(C)C)c(=O)c1Cl