Reaction Details
Target5-hydroxytryptamine receptor 1A
LigandBDBM50122243
Substrate/Competitorn/a
Meas. Tech.ChEBML_1141
Ki 0.800000±n/a nM
Citation Betti, LFloridi, MGiannaccini, GManetti, FStrappaghetti, GTafi, ABotta, M alpha1-Adrenoceptor antagonists. 5. Pyridazinone-arylpiperazines. Probing the influence on affinity and selectivity of both ortho-alkoxy groups at the arylpiperazine moiety and cyclic substituents at the pyridazinone nucleus. Bioorg Med Chem Lett13:171-3 (2002) 5-hydroxytryptamine receptor 1A
Name:5-hydroxytryptamine receptor 1A
Type:G Protein-Coupled Receptor (GPCR)
Mol. Mass.:46445.29
Organism:Rattus norvegicus (rat)
Description:Binding assays were performed using rat hippocampal membranes.
Residue:422
BDBM50122243
NameBDBM50122243
Synonyms:4-Chloro-5-[4-(furan-2-carbonyl)-piperazin-1-yl]-2-{7-[4-(2-isopropoxy-phenyl)-piperazin-1-yl]-heptyl}-2H-pyridazin-3-one CHEMBL47792
TypeSmall organic molecule
Emp. Form.C33H45ClN6O4
Mol. Mass.625.201
SMILESCC(C)Oc1ccccc1N1CCN(CCCCCCCn2ncc(N3CCN(CC3)C(=O)c3ccco3)c(Cl)c2=O)CC1