Reaction Details
TargetAlpha-1A/Alpha-1B/Alpha-1D adrenergic receptor
LigandBDBM50122238
Substrate/Competitorn/a
Meas. Tech.ChEMBL_34577 (CHEMBL882498)
Ki 0.430000±n/a nM
Citation Betti, LFloridi, MGiannaccini, GManetti, FStrappaghetti, GTafi, ABotta, M alpha1-Adrenoceptor antagonists. 5. Pyridazinone-arylpiperazines. Probing the influence on affinity and selectivity of both ortho-alkoxy groups at the arylpiperazine moiety and cyclic substituents at the pyridazinone nucleus. Bioorg Med Chem Lett13:171-3 (2002) Alpha-1A/Alpha-1B/Alpha-1D adrenergic receptor
Name:Alpha-1A/Alpha-1B/Alpha-1D adrenergic receptor
Type:n/a
Mol. Mass.:n/a
Description:ASSAY_ID of EBI is 303470
Components:This complex has 3 components.
Component 1
Name:Alpha-1B adrenergic receptor
Synonyms:ADA1B_RAT Alpha 1B-adrenoceptor Alpha adrenergic receptor 1A and 1B Alpha-1Adrenoceptor Alpha-1B adrenoreceptor | adrenergic Alpha1B
Type:G Protein-Coupled Receptor (GPCR)
Mol. Mass.:56606.71
Organism:Rattus norvegicus (rat)
Description:Receptor binding assays were performed using rat cortical membranes.
Residue:515
Component 2
Name:Alpha-1A adrenergic receptor
Synonyms:ADA1A_RAT Adra1c Alpha-1A adrenoceptor Alpha-1C adrenergic receptor | adrenergic Alpha1A
Type:Protein
Mol. Mass.:51620.15
Organism:Rattus norvegicus (Rat)
Description:P43140
Residue:466
Component 3
Name:Alpha-1D adrenergic receptor
Synonyms:ADA1D_RAT Adra1d Alpha-1D adrenergic receptor | Serotonin 1a (5-HT1a) receptor/Adrenergic receptor alpha-1
Type:Protein
Mol. Mass.:59375.97
Organism:Rattus norvegicus (Rat)
Description:P23944
Residue:561
BDBM50122238
NameBDBM50122238
Synonyms:4-Chloro-5-{4-[2-(2-ethoxy-phenoxy)-ethyl]-piperazin-1-yl}-2-{7-[4-(2-ethoxy-phenyl)-piperazin-1-yl]-heptyl}-2H-pyridazin-3-one CHEMBL300094
TypeSmall organic molecule
Emp. Form.C37H53ClN6O4
Mol. Mass.681.308
SMILESCCOc1ccccc1OCCN1CCN(CC1)c1cnn(CCCCCCCN2CCN(CC2)c2ccccc2OCC)c(=O)c1Cl