Reaction Details
TargetRetinoic acid receptor beta
LigandBDBM50122351
Substrate/Competitorn/a
Meas. Tech.ChEMBL_195477 (CHEMBL798154)
EC50 17±n/a nM
Citation Farmer, LJZhi, LJeong, SLamph, WWOsburn, DLCroston, GFlatten, KSHeyman, RANadzan, AM Retinoic acid receptor ligands based on the 6-cyclopropyl-2,4-hexadienoic acid. Bioorg Med Chem Lett13:261-4 (2002) Retinoic acid receptor beta
Name:Retinoic acid receptor beta
Type:PROTEIN
Mol. Mass.:50498.70
Organism:Homo sapiens (Human)
Description:ChEMBL_1458015
Residue:455
BDBM50122351
NameBDBM50122351
Synonyms:(2E,4E)-3-Methyl-6-[1-(5,5,8,8-tetramethyl-5,6,7,8-tetrahydro-naphthalen-2-yl)-cyclopropyl]-hexa-2,4-dienoic acid | CHEMBL89331
TypeSmall organic molecule
Emp. Form.C24H32O2
Mol. Mass.352.5097
SMILESC\C(\C=C\CC1(CC1)c1ccc2c(c1)C(C)(C)CCC2(C)C)=C/C(O)=O