Reaction Details
TargetRetinoic acid receptor RXR-gamma
LigandBDBM50122352
Substrate/Competitorn/a
Meas. Tech.ChEBML_197228
Kd 153±n/a nM
Citation Farmer, LJZhi, LJeong, SLamph, WWOsburn, DLCroston, GFlatten, KSHeyman, RANadzan, AM Retinoic acid receptor ligands based on the 6-cyclopropyl-2,4-hexadienoic acid. Bioorg Med Chem Lett13:261-4 (2002) Retinoic acid receptor RXR-gamma
Name:Retinoic acid receptor RXR-gamma
Type:PROTEIN
Mol. Mass.:50878.26
Organism:Homo sapiens (Human)
Description:ChEMBL_197216
Residue:463
BDBM50122352
NameBDBM50122352
Synonyms:(2E,4E)-3-Methyl-6-[1-(3,5,5,8,8-pentamethyl-5,6,7,8-tetrahydro-naphthalen-2-yl)-cyclopropyl]-hexa-2,4-dienoic acid | CHEMBL89058
TypeSmall organic molecule
Emp. Form.C25H34O2
Mol. Mass.366.5363
SMILESC\C(\C=C\CC1(CC1)c1cc2c(cc1C)C(C)(C)CCC2(C)C)=C/C(O)=O